Reaction Details
TargetProstaglandin F2-alpha receptor
LigandBDBM244800
Substrate/Competitorn/a
Meas. Tech.Inhibition Assay
Ki 6±0.0 nM
Citation Page, PNSchwarz, MJorand-Lebrun, CQuattropani, APomel, V α-amino esters of hydroxypropylthiazolidine carboxamide derivative and salt form, crystal polymorph thereof US Patent US9447055 Publication Date 9/20/2016
 
Prostaglandin F2-alpha receptor
Name:Prostaglandin F2-alpha receptor
Type:Enzyme
Mol. Mass.:40072.29
Organism:Homo sapiens (Human)
Description:P43088
Residue:359
BDBM244800
NameBDBM244800
Synonyms:US9447055, II
TypeSmall organic molecule
Emp. Form.C25H25FN2O4S2
Mol. Mass.500.605
SMILESOCC[C@H](NC(=O)[C@@H]1SCCN1S(=O)(=O)c1ccc(cc1)-c1ccccc1)c1ccc(F)cc1