Reaction Details
TargetUrease
LigandBDBM246471
Substrate/Competitorn/a
Meas. Tech.Urease Inhibition Assay
pH6.8±0
Temperature303.15±0 K
IC50 3.07e+4± 9.4e+2 nM
Citation Adsul, LKBandgar, BPChavan, HVJalde, SSDhakane, VDShirfule, AL Synthesis and biological evaluation of novel series of aminopyrimidine derivatives as urease inhibitors and antimicrobial agents. J Enzyme Inhib Med Chem28:1316-23 (2013) 
 
Urease
Name:Urease
Type:Enzyme
Mol. Mass.:90746.20
Organism:Canavalia ensiformis (Jack bean) (Horse bean)
Description:P07374
Residue:840
BDBM246471
NameBDBM246471
Synonyms:4-(3,4-Dimethoxyphenyl)-6-(9-methyl-9H-carbazol-3-yl)-pyrimidin-2-amine (5c)
TypeSmall organic molecule
Emp. Form.C25H22N4O2
Mol. Mass.410.4678
SMILESCOc1ccc(cc1OC)-c1cc(nc(N)n1)-c1ccc2n(C)c3ccccc3c2c1