Reaction Details
TargetUrease
LigandBDBM246481
Substrate/Competitorn/a
Meas. Tech.Urease Inhibition Assay
pH6.8±0
Temperature303.15±0 K
IC50 8.72e+4± 6.0e+2 nM
Citation Adsul, LKBandgar, BPChavan, HVJalde, SSDhakane, VDShirfule, AL Synthesis and biological evaluation of novel series of aminopyrimidine derivatives as urease inhibitors and antimicrobial agents. J Enzyme Inhib Med Chem28:1316-23 (2013) 
 
Urease
Name:Urease
Type:Enzyme
Mol. Mass.:90746.20
Organism:Canavalia ensiformis (Jack bean) (Horse bean)
Description:P07374
Residue:840
BDBM246481
NameBDBM246481
Synonyms:4-(9-Methyl-9H-carbazol-3-yl)-6-(4-nitrophenyl)-pyrimidin-2-amine (5m)
TypeSmall organic molecule
Emp. Form.C23H17N5O2
Mol. Mass.395.4134
SMILESCn1c2ccccc2c2cc(ccc12)-c1cc(nc(N)n1)-c1ccc(cc1)[N+]([O-])=O