Reaction Details
TargetCarbonic anhydrase 2
LigandBDBM246510
Substrate/Competitorn/a
Meas. Tech.In Vitro Inhibition Assay
IC50 6.309e+4±n/a nM
Citation Celik, FArslan, MYavuz, EDemir, DGençer, N Synthesis and carbonic anhydrase inhibitory properties of novel 1,4-dihydropyrimidinone substituted diarylureas. J Enzyme Inhib Med Chem29:18-22 (2014) 
 
Carbonic anhydrase 2
Name:Carbonic anhydrase 2
Type:Enzyme
Mol. Mass.:29250.71
Organism:Homo sapiens (Human)
Description:P00918
Residue:260
BDBM246510
NameBDBM246510
Synonyms:1-(4-(1,3,7,7-Tetramethyl-5-oxo-1,2,3,4,5,6,7,8-octahydroquinazolin-4-yl)phenyl)-3-(3-(trifluoromethyl)phenyl)thiourea (4f)
TypeSmall organic molecule
Emp. Form.C26H27F3N4O2S
Mol. Mass.516.578
SMILESCN1C(C2=C(CC(C)(C)CC2=O)N(C)C1=O)c1ccc(NC(=S)Nc2cccc(c2)C(F)(F)F)cc1