Reaction Details
TargetReplicase polyprotein 1a
LigandBDBM246524
Substrate/CompetitorBDBM246526
Meas. Tech.SARS-CoV PLpro Inhibition Assay
pH8±0
Ki 1.7e+3± 4e+2 nM
IC50 4.2e+3± 1.0e+3 nM
Citation Kim, DWSeo, KHCurtis-Long, MJOh, KYOh, JWCho, JKLee, KHPark, KH Phenolic phytochemical displaying SARS-CoV papain-like protease inhibition from the seeds of Psoralea corylifolia. J Enzyme Inhib Med Chem29:59-63 (2014) 
 
Replicase polyprotein 1a
Name:Replicase polyprotein 1a
Type:Enzyme
Mol. Mass.:486353.36
Organism:Human SARS coronavirus (SARS-CoV)
Description:P0C6U8
Residue:4382
BDBM246524
BDBM246526
NameBDBM246524
Synonyms:Psoralidin (5)
TypeSmall organic molecule
Emp. Form.C20H16O5
Mol. Mass.336.338
SMILES[#6]\[#6](-[#6])=[#6]\[#6]-c1cc2c3oc4cc(-[#8])ccc4c3c(=O)oc2cc1-[#8]