Reaction Details
TargetDNA topoisomerase 1
LigandBDBM50127140
Substrate/Competitorn/a
Meas. Tech.Topoisomerase I Relaxation Assay
pH7.8±0
Temperature310.15±0 K
IC50>3.50e+5± 1.00e+4 nM
Citation Siwek, ABielawska, AMaciorkowska, ELepiarczyk, MBielawski, KTrotsko, NWujec, M Cytotoxicity and topoisomerase I/II inhibition activity of novel 4-aryl/alkyl-1-(piperidin-4-yl)-carbonylthiosemicarbazides and 4-benzoylthiosemicarbazides. J Enzyme Inhib Med Chem29:243-8 (2014) 
 
DNA topoisomerase 1
Name:DNA topoisomerase 1
Type:Enzyme
Mol. Mass.:90771.02
Organism:Homo sapiens (Human)
Description:P11387
Residue:765
BDBM50127140
NameBDBM50127140
Synonyms:(-)-etoposide 4'-Demethylepipodophyllotoxin 9-(4,6-O-(R)-ethylidene-beta-D-glucopyranoside) 9-((4,6-O-Ethylidine-beta-D-glucopyranosyl)oxy)-5,8,8a,9-tetrahydro-5-(4-hydroxy-3,4-dimethyloxyphenyl)furo(3',4'':6,7)naptho-(2,3-d)-1,3-dioxol-6(5aH)-one Etoposide (ET) VP-16 | etoposide
TypeSmall organic molecule
Emp. Form.C29H32O13
Mol. Mass.588.5566
SMILESCOc1cc(cc(OC)c1O)[C@H]1[C@@H]2[C@H](COC2=O)[C@H](O[C@@H]2O[C@@H]3CO[C@@H](C)O[C@H]3[C@H](O)[C@H]2O)c2cc3OCOc3cc12