Reaction Details
TargetNeuronal acetylcholine receptor subunit alpha-7
LigandBDBM247999
Substrate/Competitorn/a
Meas. Tech.Radioligand Binding Assay
pH7.4±n/a
Temperature310.15±n/a K
Ki 27.6±n/a nM
IC50 31.8±n/a nM
Commentsextracted
Citation Bilcer, GMNg, R Quinuclidines for modulating alpha 7 activity US Patent US9434724 Publication Date 9/6/2016
 
Neuronal acetylcholine receptor subunit alpha-7
Name:Neuronal acetylcholine receptor subunit alpha-7
Type:Enzyme
Mol. Mass.:56502.44
Organism:Rattus norvegicus (Rat)
Description:Q05941
Residue:502
BDBM247999
NameBDBM247999
Synonyms:US9434724, 1
TypeSmall organic molecule
Emp. Form.C17H20N2O2
Mol. Mass.284.3529
SMILESO=C(OCC12CCN(CC1)CC2)c1c[nH]c2ccccc12