Reaction Details
TargetNeuronal acetylcholine receptor subunit alpha-7
LigandBDBM247978
Substrate/Competitorn/a
Meas. Tech.Radioligand Binding Assay
pH7.4±n/a
Temperature310.15±n/a K
Ki 45±n/a nM
IC50 52.5±n/a nM
Commentsextracted
Citation Bilcer, GMNg, R Quinuclidines for modulating alpha 7 activity US Patent US9434724 Publication Date 9/6/2016
 
Neuronal acetylcholine receptor subunit alpha-7
Name:Neuronal acetylcholine receptor subunit alpha-7
Type:Enzyme
Mol. Mass.:56502.44
Organism:Rattus norvegicus (Rat)
Description:Q05941
Residue:502
BDBM247978
NameBDBM247978
Synonyms:US9434724, 75
TypeSmall organic molecule
Emp. Form.C19H24N2O3
Mol. Mass.328.4055
SMILESCOc1c(C)ccc2[nH]cc(C(=O)OCC34CCN(CC3)CC4)c12