Reaction Details
TargetReceptor-type tyrosine-protein kinase FLT3 [D835H]
LigandBDBM247371
Substrate/Competitorn/a
Meas. Tech.KINOMEScan Technology Assays
Kd 11±n/a nM
Citation Blagg, JBavetsias, VMoore, ASLinardopoulos, S Pharmaceutically active compounds US Patent US9447092 Publication Date 9/20/2016
 
Receptor-type tyrosine-protein kinase FLT3 [D835H]
Name:Receptor-type tyrosine-protein kinase FLT3 [D835H]
Type:n/a
Mol. Mass.:112912.18
Organism:Homo sapiens (Human)
Description:P36888 D835H
Residue:993
BDBM247371
NameBDBM247371
Synonyms:US9447092, 1
TypeSmall organic molecule
Emp. Form.C22H23Cl2N7
Mol. Mass.456.371
SMILESCc1nn(C)cc1-c1nc2c(N3CCN(Cc4ccc(Cl)cc4)CC3)c(Cl)cnc2[nH]1