Reaction Details
TargetReceptor-type tyrosine-protein kinase FLT3 [N841I]
LigandBDBM247371
Substrate/Competitorn/a
Meas. Tech.KINOMEScan Technology Assays
Kd 16±n/a nM
Citation Blagg, JBavetsias, VMoore, ASLinardopoulos, S Pharmaceutically active compounds US Patent US9447092 Publication Date 9/20/2016
 
Receptor-type tyrosine-protein kinase FLT3 [N841I]
Name:Receptor-type tyrosine-protein kinase FLT3 [N841I]
Type:Tyrosine-protein kinase
Mol. Mass.:112887.67
Organism:Homo sapiens (Human)
Description:gi_121114304
Residue:993
BDBM247371
NameBDBM247371
Synonyms:US9447092, 1
TypeSmall organic molecule
Emp. Form.C22H23Cl2N7
Mol. Mass.456.371
SMILESCc1nn(C)cc1-c1nc2c(N3CCN(Cc4ccc(Cl)cc4)CC3)c(Cl)cnc2[nH]1