Reaction Details
TargetCarbonic anhydrase 2
LigandBDBM50022180
Substrate/Competitorn/a
Meas. Tech.CA Inhibition Assay
pH7.5±n/a
Temperature277.15±n/a K
Ki>2.00e+5±n/a nM
Commentsextracted
Citation Sharma, ATiwari, MSupuran, CT Novel coumarins and benzocoumarins acting as isoform-selective inhibitors against the tumor-associated carbonic anhydrase IX. J Enzyme Inhib Med Chem29:292-6 (2014) 
 
Carbonic anhydrase 2
Name:Carbonic anhydrase 2
Type:Enzyme
Mol. Mass.:29250.71
Organism:Homo sapiens (Human)
Description:P00918
Residue:260
BDBM50022180
NameBDBM50022180
Synonyms:5,7-Dihydroxy-4-methyl-2H-chromen-2-one (2) 5,7-dihydroxy-4-methyl-2H-chromen-2-one Coumarin derivative, 1b
TypeSmall organic molecule
Emp. Form.C10H8O4
Mol. Mass.192.1681
SMILESCc1cc(=O)oc2cc(O)cc(O)c12