Reaction Details
TargetCarbonic anhydrase 2
LigandBDBM248070
Substrate/Competitorn/a
Meas. Tech.CA Inhibition Assay
pH7.5±n/a
Temperature277.15±n/a K
Ki>2.00e+5±n/a nM
Commentsextracted
Citation Sharma, ATiwari, MSupuran, CT Novel coumarins and benzocoumarins acting as isoform-selective inhibitors against the tumor-associated carbonic anhydrase IX. J Enzyme Inhib Med Chem29:292-6 (2014) 
 
Carbonic anhydrase 2
Name:Carbonic anhydrase 2
Type:Enzyme
Mol. Mass.:29250.71
Organism:Homo sapiens (Human)
Description:P00918
Residue:260
BDBM248070
NameBDBM248070
Synonyms:4-Methyl-2H-benzo[g]chromen-2-one (5)
TypeSmall organic molecule
Emp. Form.C14H10O2
Mol. Mass.210.228
SMILESCc1cc(=O)oc2cc3ccccc3cc12