Reaction Details
TargetHexokinase-4
LigandBDBM249157
Substrate/Competitorn/a
Meas. Tech.Glucokinase-Activating Assay
Temperature303.15±n/a K
EC50 8.9±n/a nM
Commentsextracted
Citation Lin, SZhang, RCampbell, BDewnani, SVXu, JXu, LParmee, ERKats-Kagan, R Glucokinase activator compounds, compositions containing such compounds, and methods of treatment US Patent US9453038 Publication Date 9/27/2016
 
Hexokinase-4
Name:Hexokinase-4
Type:Enzyme
Mol. Mass.:52175.81
Organism:Homo sapiens (Human)
Description:P35557
Residue:465
BDBM249157
NameBDBM249157
Synonyms:US9453038, 35
TypeSmall organic molecule
Emp. Form.C27H27N3O6S2
Mol. Mass.553.65
SMILESCOC(=O)CCc1cnc(s1)-c1cc2cc(Oc3ccc(cc3)S(C)(=O)=O)c(cc2[nH]1)C1CCC(=O)N1C