Reaction Details
TargetHexokinase-4
LigandBDBM249159
Substrate/Competitorn/a
Meas. Tech.Glucokinase-Activating Assay
Temperature303.15±n/a K
EC50 23.5±n/a nM
Commentsextracted
Citation Lin, SZhang, RCampbell, BDewnani, SVXu, JXu, LParmee, ERKats-Kagan, R Glucokinase activator compounds, compositions containing such compounds, and methods of treatment US Patent US9453038 Publication Date 9/27/2016
 
Hexokinase-4
Name:Hexokinase-4
Type:Enzyme
Mol. Mass.:52175.81
Organism:Homo sapiens (Human)
Description:P35557
Residue:465
BDBM249159
NameBDBM249159
Synonyms:US9453038, 37
TypeSmall organic molecule
Emp. Form.C27H31N4O7PS2
Mol. Mass.618.661
SMILESCCOP(=O)(Cc1cnc(s1)-c1cc2cc(Oc3ccc(nc3)S(C)(=O)=O)c(cc2[nH]1)C1CCC(=O)N1C)OCC