Reaction Details
Target11-beta-hydroxysteroid dehydrogenase 1
LigandBDBM250453
Substrate/Competitorn/a
Meas. Tech.HTRF Assay
pH6±n/a
Temperature298.15±n/a K
IC50 0.4±n/a nM
Commentsextracted
Citation Ahn, SKAuh, JChoi, NSHan, CKKim, TPae, KShin, YJHan, DHan, CK Compound having ability to inhibit 11Beta-HSD1 enzyme or pharmaceutically acceptable salt thereof, method for producing same, and pharmaceutical composition containing same as active ingredient US Patent US9464044 Publication Date 10/11/2016
 
11-beta-hydroxysteroid dehydrogenase 1
Name:11-beta-hydroxysteroid dehydrogenase 1
Type:Enzyme
Mol. Mass.:32409.16
Organism:Homo sapiens (Human)
Description:P28845
Residue:292
BDBM250453
NameBDBM250453
Synonyms:US9464044, 50
TypeSmall organic molecule
Emp. Form.C24H30N4O4S
Mol. Mass.470.584
SMILESCn1ccc2cccc(c12)S(=O)(=O)NC1(CC1)C(=O)N[C@H]1C2CC3CC1CC(C3)(C2)C(N)=O