Reaction Details
Target11-beta-hydroxysteroid dehydrogenase 1
LigandBDBM250460
Substrate/Competitorn/a
Meas. Tech.HTRF Assay
pH6±n/a
Temperature298.15±n/a K
IC50 0.12±n/a nM
Commentsextracted
Citation Ahn, SKAuh, JChoi, NSHan, CKKim, TPae, KShin, YJHan, DHan, CK Compound having ability to inhibit 11Beta-HSD1 enzyme or pharmaceutically acceptable salt thereof, method for producing same, and pharmaceutical composition containing same as active ingredient US Patent US9464044 Publication Date 10/11/2016
 
11-beta-hydroxysteroid dehydrogenase 1
Name:11-beta-hydroxysteroid dehydrogenase 1
Type:Enzyme
Mol. Mass.:32409.16
Organism:Homo sapiens (Human)
Description:P28845
Residue:292
BDBM250460
NameBDBM250460
Synonyms:US9464044, 62
TypeSmall organic molecule
Emp. Form.C22H28ClN3O4S
Mol. Mass.465.993
SMILESCN(C1(CC1)C(=O)N[C@H]1C2CC3CC1CC(C3)(C2)C(N)=O)S(=O)(=O)c1cccc(Cl)c1