Reaction Details
Target11-beta-hydroxysteroid dehydrogenase 1
LigandBDBM50112152
Substrate/Competitorn/a
Meas. Tech.HTRF Assay
pH6±n/a
Temperature298.15±n/a K
IC50 0.36±n/a nM
Commentsextracted
Citation Ahn, SKAuh, JChoi, NSHan, CKKim, TPae, KShin, YJHan, DHan, CK Compound having ability to inhibit 11Beta-HSD1 enzyme or pharmaceutically acceptable salt thereof, method for producing same, and pharmaceutical composition containing same as active ingredient US Patent US9464044 Publication Date 10/11/2016
 
11-beta-hydroxysteroid dehydrogenase 1
Name:11-beta-hydroxysteroid dehydrogenase 1
Type:Enzyme
Mol. Mass.:32409.16
Organism:Homo sapiens (Human)
Description:P28845
Residue:292
BDBM50112152
NameBDBM50112152
Synonyms:CHEMBL3608401 | US9464044, 84
TypeSmall organic molecule
Emp. Form.C21H27F2N3O4S
Mol. Mass.455.519
SMILESCC(C)(NS(=O)(=O)c1c(F)cccc1F)C(=O)N[C@H]1C2CC3CC1CC(C3)(C2)C(N)=O