Reaction Details
Target11-beta-hydroxysteroid dehydrogenase 1
LigandBDBM250418
Substrate/Competitorn/a
Meas. Tech.HTRF Assay
pH6±n/a
Temperature298.15±n/a K
IC50 0.3±n/a nM
Commentsextracted
Citation Ahn, SKAuh, JChoi, NSHan, CKKim, TPae, KShin, YJHan, DHan, CK Compound having ability to inhibit 11Beta-HSD1 enzyme or pharmaceutically acceptable salt thereof, method for producing same, and pharmaceutical composition containing same as active ingredient US Patent US9464044 Publication Date 10/11/2016
 
11-beta-hydroxysteroid dehydrogenase 1
Name:11-beta-hydroxysteroid dehydrogenase 1
Type:Enzyme
Mol. Mass.:32409.16
Organism:Homo sapiens (Human)
Description:P28845
Residue:292
BDBM250418
NameBDBM250418
Synonyms:US9464044, 8
TypeSmall organic molecule
Emp. Form.C22H27ClFN3O4S
Mol. Mass.483.984
SMILESNC(=O)C12CC3CC(C1)[C@H](NC(=O)C1(CNS(=O)(=O)c4cccc(Cl)c4F)CC1)C(C3)C2