Reaction Details
TargetCarbonate dehydratase
LigandBDBM10880
Substrate/Competitorn/a
Meas. Tech.ChEMBL_158308 (CHEMBL763365)
pH7.5±0
Temperature293.15±0 K
Ki 27±0 nM
Km1600000±0 nM
Citation Del Prete, SVullo, DDe Luca, VCarginale, Vdi Fonzo, POsman, SMAlOthman, ZSupuran, CTCapasso, C Anion inhibition profiles of a-, ß- and ¿-carbonic anhydrases from the pathogenic bacterium Vibrio cholerae. Bioorg Med Chem24:3413-7 (2016) 
 
Carbonate dehydratase
Name:Carbonate dehydratase
Type:Protein
Mol. Mass.:26160.23
Organism:Porphyromonas gingivalis JCVI SC001
Description:T2NA71
Residue:242
BDBM10880
NameBDBM10880
Synonyms:AZA AZM acetazolamide Acetazolamide Acetazolamide (AZA) Acetazolamide, 5 Acetazolamide, AZA CHEMBL20 Sulfonamide, 1 US11278534, Example acetazolamide sulfonamide 1
TypeSmall organic molecule
Emp. Form.C4H6N4O3S2
Mol. Mass.222.245
SMILESCC(=O)Nc1nnc(s1)S(N)(=O)=O