Reaction Details
TargetCarbonic anhydrase 1
LigandBDBM26979
Substrate/Competitorn/a
Meas. Tech.ChEMBL_158304 (CHEMBL763189)
pH7.5±n/a
Temperature293.15±n/a K
Ki 6000000±n/a nM
Citation Del Prete, SVullo, DDe Luca, VCarginale, Vdi Fonzo, POsman, SMAlOthman, ZSupuran, CTCapasso, C Anion inhibition profiles of a-, ß- and ¿-carbonic anhydrases from the pathogenic bacterium Vibrio cholerae. Bioorg Med Chem24:3413-7 (2016) 
 
Carbonic anhydrase 1
Name:Carbonic anhydrase 1
Type:Enzyme
Mol. Mass.:28873.37
Organism:Homo sapiens (Human)
Description:P00915
Residue:261
BDBM26979
NameBDBM26979
Synonyms:CHEMBL69710 POTASSIUM CHLORIDE chloride | chloride ion
TypeIon
Emp. Form.Cl
Mol. Mass.35.454
SMILES[Cl-]