Reaction Details
TargetCarbonic anhydrase 1
LigandBDBM26985
Substrate/Competitorn/a
Meas. Tech.ChEMBL_158304 (CHEMBL763189)
pH7.5±n/a
Temperature293.15±n/a K
Ki 1200±n/a nM
Citation Del Prete, SVullo, DDe Luca, VCarginale, Vdi Fonzo, POsman, SMAlOthman, ZSupuran, CTCapasso, C Anion inhibition profiles of a-, ß- and ¿-carbonic anhydrases from the pathogenic bacterium Vibrio cholerae. Bioorg Med Chem24:3413-7 (2016) 
 
Carbonic anhydrase 1
Name:Carbonic anhydrase 1
Type:Enzyme
Mol. Mass.:28873.37
Organism:Homo sapiens (Human)
Description:P00915
Residue:261
BDBM26985
NameBDBM26985
Synonyms:2-triaza-1,2-diyne CHEMBL89295 azide
TypeIon
Emp. Form.N3
Mol. Mass.42.0206
SMILES[N-]=[N+]=[N-]