Reaction Details
TargetCarbonic anhydrase
LigandBDBM26985
Substrate/Competitorn/a
Meas. Tech.ChEMBL_158307 (CHEMBL763192)
pH7.5±n/a
Temperature293.15±n/a K
Ki 76000±n/a nM
Citation Del Prete, SVullo, DDe Luca, VCarginale, Vdi Fonzo, POsman, SMAlOthman, ZSupuran, CTCapasso, C Anion inhibition profiles of a-, ß- and ¿-carbonic anhydrases from the pathogenic bacterium Vibrio cholerae. Bioorg Med Chem24:3413-7 (2016) 
 
Carbonic anhydrase
Name:Carbonic anhydrase
Synonyms:VchCA
Type:Protein
Mol. Mass.:26434.13
Organism:Vibrio cholerae serotype O1 (strain ATCC 39315 / El Tor Inaba N16961)
Description:Q9KMP6
Residue:239
BDBM26985
NameBDBM26985
TypeIon
Emp. Form.N3
Mol. Mass.42.0206
SMILES[N-]=[N+]=[N-]