Reaction Details
TargetCarbonic anhydrase
LigandBDBM50010231
Substrate/Competitorn/a
Meas. Tech.ChEMBL_158307 (CHEMBL763192)
pH7.5±n/a
Temperature293.15±n/a K
Ki 43000±n/a nM
Citation Del Prete, SVullo, DDe Luca, VCarginale, Vdi Fonzo, POsman, SMAlOthman, ZSupuran, CTCapasso, C Anion inhibition profiles of a-, ß- and ¿-carbonic anhydrases from the pathogenic bacterium Vibrio cholerae. Bioorg Med Chem24:3413-7 (2016) 
 
Carbonic anhydrase
Name:Carbonic anhydrase
Synonyms:VchCA
Type:Protein
Mol. Mass.:26434.13
Organism:Vibrio cholerae serotype O1 (strain ATCC 39315 / El Tor Inaba N16961)
Description:Q9KMP6
Residue:239
BDBM50010231
NameBDBM50010231
TypeSmall organic molecule
Emp. Form.C5H10NS2
Mol. Mass.148.27
SMILESCCN(CC)C([S-])=S