Reaction Details
TargetCarbonic anhydrase
LigandBDBM50344898
Substrate/Competitorn/a
Meas. Tech.ChEMBL_158311 (CHEMBL763368)
pH7.5±n/a
Temperature293.15±n/a K
Ki 8400000±n/a nM
Citation Del Prete, SVullo, DDe Luca, VCarginale, Vdi Fonzo, POsman, SMAlOthman, ZSupuran, CTCapasso, C Anion inhibition profiles of a-, ß- and ¿-carbonic anhydrases from the pathogenic bacterium Vibrio cholerae. Bioorg Med Chem24:3413-7 (2016) 
 
Carbonic anhydrase
Name:Carbonic anhydrase
Type:Protein
Mol. Mass.:25222.79
Organism:Vibrio cholerae
Description:A0A086SLX8
Residue:222
BDBM50344898
NameBDBM50344898
Synonyms:CHEMBL1081267 | sodium perruthenate
TypeSmall organic molecule
Emp. Form.O4Ru
Mol. Mass.165.07
SMILESO=[Ru-](=O)(=O)=O