Reaction Details
TargetGamma carbonic anhydrase family protein
LigandBDBM26979
Substrate/Competitorn/a
Meas. Tech.ChEMBL_158313 (CHEMBL763370)
pH7.5±n/a
Temperature293.15±n/a K
Ki 8800000±n/a nM
Citation Del Prete, SVullo, DDe Luca, VCarginale, Vdi Fonzo, POsman, SMAlOthman, ZSupuran, CTCapasso, C Anion inhibition profiles of a-, ß- and ¿-carbonic anhydrases from the pathogenic bacterium Vibrio cholerae. Bioorg Med Chem24:3413-7 (2016) 
 
Gamma carbonic anhydrase family protein
Name:Gamma carbonic anhydrase family protein
Type:Protein
Mol. Mass.:19753.38
Organism:Vibrio cholerae
Description:A0A0H7HLM5
Residue:183
BDBM26979
NameBDBM26979
Synonyms:CHEMBL69710 POTASSIUM CHLORIDE chloride | chloride ion
TypeIon
Emp. Form.Cl
Mol. Mass.35.454
SMILES[Cl-]