Reaction Details
TargetSerine/threonine-protein kinase mTOR [1360-2549]
LigandBDBM251585
Substrate/Competitorn/a
Meas. Tech.LanthaScreen Kinase Activity Assay
pH7.5±n/a
Temperature298.15±n/a K
IC50 588±n/a nM
Commentsextracted
Citation Pastor Fernández, JFernández-Capetillo Ruiz, OMartínez González, SBlanco Aparicio, CRico Ferreira, MToledo Lázaro, LIRodríguez Arísteguí, SMurga Costa, MVarela Busto, CLopez Contreras, AJRenner, ONieto Soler, MCebrián Muñoz, DA Chemical entities US Patent US9453031 Publication Date 9/27/2016
 
Serine/threonine-protein kinase mTOR [1360-2549]
Name:Serine/threonine-protein kinase mTOR [1360-2549]
Type:Enzyme
Mol. Mass.:136306.16
Organism:Homo sapiens (Human)
Description:aa 1360-2549
Residue:1190
BDBM251585
NameBDBM251585
Synonyms:US9453031, 8
TypeSmall organic molecule
Emp. Form.C21H26N6O4S
Mol. Mass.458.534
SMILESCNc1nc2ccccc2n1-c1nc2N3CCOCC3COc2c(n1)C(C)(C)S(C)(=O)=O