Reaction Details
TargetSerine/threonine-protein kinase mTOR [1360-2549]
LigandBDBM251606
Substrate/Competitorn/a
Meas. Tech.LanthaScreen Kinase Activity Assay
pH7.5±n/a
Temperature298.15±n/a K
IC50 435±n/a nM
Commentsextracted
Citation Pastor Fernández, JFernández-Capetillo Ruiz, OMartínez González, SBlanco Aparicio, CRico Ferreira, MToledo Lázaro, LIRodríguez Arísteguí, SMurga Costa, MVarela Busto, CLopez Contreras, AJRenner, ONieto Soler, MCebrián Muñoz, DA Chemical entities US Patent US9453031 Publication Date 9/27/2016
 
Serine/threonine-protein kinase mTOR [1360-2549]
Name:Serine/threonine-protein kinase mTOR [1360-2549]
Type:Enzyme
Mol. Mass.:136306.16
Organism:Homo sapiens (Human)
Description:aa 1360-2549
Residue:1190
BDBM251606
NameBDBM251606
Synonyms:US9453031, 29
TypeSmall organic molecule
Emp. Form.C24H28N4O6S
Mol. Mass.500.567
SMILESCOc1cc(-c2nc3N4CCOC[C@H]4COc3c(n2)C2(CCOCC2)S(C)(=O)=O)c2cc[nH]c2c1