Reaction Details
TargetDNA-dependent protein kinase catalytic subunit
LigandBDBM251621
Substrate/Competitorn/a
Meas. Tech.ADP Hunter Plus Assay
pH7.5±n/a
Temperature310.15±n/a K
IC50 3060±n/a nM
Commentsextracted
Citation Pastor Fernández, JFernández-Capetillo Ruiz, OMartínez González, SBlanco Aparicio, CRico Ferreira, MToledo Lázaro, LIRodríguez Arísteguí, SMurga Costa, MVarela Busto, CLopez Contreras, AJRenner, ONieto Soler, MCebrián Muñoz, DA Chemical entities US Patent US9453031 Publication Date 9/27/2016
 
DNA-dependent protein kinase catalytic subunit
Name:DNA-dependent protein kinase catalytic subunit
Type:Protein
Mol. Mass.:469114.78
Organism:Homo sapiens (Human)
Description:P78527
Residue:4128
BDBM251621
NameBDBM251621
Synonyms:US9453031, 44
TypeSmall organic molecule
Emp. Form.C20H22N4O3
Mol. Mass.366.4137
SMILESCC(C)(O)c1nc(nc2N3CCOC[C@H]3COc12)-c1cccc2[nH]ccc12