Reaction Details
TargetDNA-dependent protein kinase catalytic subunit
LigandBDBM251635
Substrate/Competitorn/a
Meas. Tech.ADP Hunter Plus Assay
pH7.5±n/a
Temperature310.15±n/a K
IC50 1600±n/a nM
Commentsextracted
Citation Pastor Fernández, JFernández-Capetillo Ruiz, OMartínez González, SBlanco Aparicio, CRico Ferreira, MToledo Lázaro, LIRodríguez Arísteguí, SMurga Costa, MVarela Busto, CLopez Contreras, AJRenner, ONieto Soler, MCebrián Muñoz, DA Chemical entities US Patent US9453031 Publication Date 9/27/2016
 
DNA-dependent protein kinase catalytic subunit
Name:DNA-dependent protein kinase catalytic subunit
Type:Protein
Mol. Mass.:469114.78
Organism:Homo sapiens (Human)
Description:P78527
Residue:4128
BDBM251635
NameBDBM251635
Synonyms:US9453031, 72
TypeSmall organic molecule
Emp. Form.C22H26N4O5S
Mol. Mass.458.531
SMILESCOc1cc(-c2nc3N4CCOC[C@H]4COc3c(n2)C(C)(C)S(C)(=O)=O)c2cc[nH]c2c1