Reaction Details
TargetMetabotropic glutamate receptor 2
LigandBDBM252635
Substrate/Competitorn/a
Meas. Tech.[35S]GTPgammaS Binding Assay
Temperature298.15±n/a K
IC50 2.8±n/a nM
Commentsextracted
Citation Takaishi, MSato, NShibuguchi, TMotoki, TTakahashi, YSasaki, TBraunton, A Tetrahydroimidazo(1,5-D)[1,4]oxazepine derivative US Patent US9458176 Publication Date 10/4/2016
 
Metabotropic glutamate receptor 2
Name:Metabotropic glutamate receptor 2
Type:Enzyme
Mol. Mass.:95584.88
Organism:Homo sapiens (Human)
Description:Q14416
Residue:872
BDBM252635
NameBDBM252635
Synonyms:US9458176, 32
TypeSmall organic molecule
Emp. Form.C22H22ClF2N3O2
Mol. Mass.433.879
SMILESC[C@@H]1Cn2c(CCO1)c(nc2-c1ccc(OC(F)F)c(Cl)c1)-c1cc(C)nc(C)c1