Reaction Details
TargetMetabotropic glutamate receptor 2
LigandBDBM252756
Substrate/Competitorn/a
Meas. Tech.[35S]GTPgammaS Binding Assay
Temperature298.15±n/a K
IC50 3.0±n/a nM
Commentsextracted
Citation Takaishi, MSato, NShibuguchi, TMotoki, TTakahashi, YSasaki, TBraunton, A Tetrahydroimidazo(1,5-D)[1,4]oxazepine derivative US Patent US9458176 Publication Date 10/4/2016
 
Metabotropic glutamate receptor 2
Name:Metabotropic glutamate receptor 2
Type:Enzyme
Mol. Mass.:95584.88
Organism:Homo sapiens (Human)
Description:Q14416
Residue:872
BDBM252756
NameBDBM252756
Synonyms:US9458176, 153
TypeSmall organic molecule
Emp. Form.C21H19ClF3N3O2
Mol. Mass.437.843
SMILESC[C@@H]1Cn2c(CCO1)c(nc2-c1ccc(OC(F)(F)F)c(Cl)c1)-c1ccnc(C)c1