Reaction Details
TargetMetabotropic glutamate receptor 2
LigandBDBM252798
Substrate/Competitorn/a
Meas. Tech.[35S]GTPgammaS Binding Assay
Temperature298.15±n/a K
IC50 3.7±n/a nM
Commentsextracted
Citation Takaishi, MSato, NShibuguchi, TMotoki, TTakahashi, YSasaki, TBraunton, A Tetrahydroimidazo(1,5-D)[1,4]oxazepine derivative US Patent US9458176 Publication Date 10/4/2016
 
Metabotropic glutamate receptor 2
Name:Metabotropic glutamate receptor 2
Type:Enzyme
Mol. Mass.:95584.88
Organism:Homo sapiens (Human)
Description:Q14416
Residue:872
BDBM252798
NameBDBM252798
Synonyms:US9458176, 195
TypeSmall organic molecule
Emp. Form.C23H20F4N4O2
Mol. Mass.460.4241
SMILESCc1cc(cc(C)n1)-c1nc(-c2ccc(OC(F)(F)F)c(c2)C#N)n2C[C@@H](CF)OCCc12