Reaction Details
TargetMetabotropic glutamate receptor 2
LigandBDBM252799
Substrate/Competitorn/a
Meas. Tech.[35S]GTPgammaS Binding Assay
Temperature298.15±n/a K
IC50 3.8±n/a nM
Commentsextracted
Citation Takaishi, MSato, NShibuguchi, TMotoki, TTakahashi, YSasaki, TBraunton, A Tetrahydroimidazo(1,5-D)[1,4]oxazepine derivative US Patent US9458176 Publication Date 10/4/2016
 
Metabotropic glutamate receptor 2
Name:Metabotropic glutamate receptor 2
Type:Enzyme
Mol. Mass.:95584.88
Organism:Homo sapiens (Human)
Description:Q14416
Residue:872
BDBM252799
NameBDBM252799
Synonyms:US9458176, 196
TypeSmall organic molecule
Emp. Form.C22H18F4N4O2
Mol. Mass.446.3975
SMILESCc1cc(ccn1)-c1nc(-c2ccc(OC(F)(F)F)c(c2)C#N)n2C[C@@H](CF)OCCc12