Reaction Details
TargetMetabotropic glutamate receptor 2
LigandBDBM252804
Substrate/Competitorn/a
Meas. Tech.[35S]GTPgammaS Binding Assay
Temperature298.15±n/a K
IC50 2.4±n/a nM
Commentsextracted
Citation Takaishi, MSato, NShibuguchi, TMotoki, TTakahashi, YSasaki, TBraunton, A Tetrahydroimidazo(1,5-D)[1,4]oxazepine derivative US Patent US9458176 Publication Date 10/4/2016
 
Metabotropic glutamate receptor 2
Name:Metabotropic glutamate receptor 2
Type:Enzyme
Mol. Mass.:95584.88
Organism:Homo sapiens (Human)
Description:Q14416
Residue:872
BDBM252804
NameBDBM252804
Synonyms:US9458176, 201
TypeSmall organic molecule
Emp. Form.C23H22F5N3O2
Mol. Mass.467.4317
SMILESCOc1cc(ccc1C(F)(F)F)-c1nc(c2CCO[C@H](CF)Cn12)-c1cc(C)nc(CF)c1