Reaction Details
TargetMetabotropic glutamate receptor 2
LigandBDBM252807
Substrate/Competitorn/a
Meas. Tech.[35S]GTPgammaS Binding Assay
Temperature298.15±n/a K
IC50 4.0±n/a nM
Commentsextracted
Citation Takaishi, MSato, NShibuguchi, TMotoki, TTakahashi, YSasaki, TBraunton, A Tetrahydroimidazo(1,5-D)[1,4]oxazepine derivative US Patent US9458176 Publication Date 10/4/2016
 
Metabotropic glutamate receptor 2
Name:Metabotropic glutamate receptor 2
Type:Enzyme
Mol. Mass.:95584.88
Organism:Homo sapiens (Human)
Description:Q14416
Residue:872
BDBM252807
NameBDBM252807
Synonyms:US9458176, 204
TypeSmall organic molecule
Emp. Form.C23H23F4N3O2
Mol. Mass.449.4412
SMILESC[C@@H]1Cn2c(CCO1)c(nc2-c1ccc(OC(F)(F)F)c(C)c1)-c1cc(C)nc(CF)c1