Reaction Details
TargetMetabotropic glutamate receptor 2
LigandBDBM252836
Substrate/Competitorn/a
Meas. Tech.[35S]GTPgammaS Binding Assay
Temperature298.15±n/a K
IC50 2.0±n/a nM
Commentsextracted
Citation Takaishi, MSato, NShibuguchi, TMotoki, TTakahashi, YSasaki, TBraunton, A Tetrahydroimidazo(1,5-D)[1,4]oxazepine derivative US Patent US9458176 Publication Date 10/4/2016
 
Metabotropic glutamate receptor 2
Name:Metabotropic glutamate receptor 2
Type:Enzyme
Mol. Mass.:95584.88
Organism:Homo sapiens (Human)
Description:Q14416
Residue:872
BDBM252836
NameBDBM252836
Synonyms:US9458176, 233
TypeSmall organic molecule
Emp. Form.C22H21ClF3N3O2
Mol. Mass.451.869
SMILESCc1cc(cc(C)n1)-c1nc(-c2ccc(OC(F)F)c(Cl)c2)n2C[C@@H](CF)OCCc12