Reaction Details
TargetMetabotropic glutamate receptor 2
LigandBDBM252846
Substrate/Competitorn/a
Meas. Tech.[35S]GTPgammaS Binding Assay
Temperature298.15±n/a K
IC50 1.7±n/a nM
Commentsextracted
Citation Takaishi, MSato, NShibuguchi, TMotoki, TTakahashi, YSasaki, TBraunton, A Tetrahydroimidazo(1,5-D)[1,4]oxazepine derivative US Patent US9458176 Publication Date 10/4/2016
 
Metabotropic glutamate receptor 2
Name:Metabotropic glutamate receptor 2
Type:Enzyme
Mol. Mass.:95584.88
Organism:Homo sapiens (Human)
Description:Q14416
Residue:872
BDBM252846
NameBDBM252846
Synonyms:US9458176, 243
TypeSmall organic molecule
Emp. Form.C24H28FN3O2
Mol. Mass.409.4964
SMILESCCOc1ccc(cc1C)-c1nc(c2CCO[C@H](CF)Cn12)-c1cc(C)nc(C)c1