Reaction Details
TargetProthrombin
LigandBDBM252980
Substrate/Competitorn/a
Meas. Tech.In Vitro Assay
pH7.4±n/a
Ki 17±n/a nM
Commentsextracted
Citation Chobanian, HBiftu, TPio, BWu, Z Thrombin inhibitors US Patent US9469608 Publication Date 10/18/2016
 
Prothrombin
Name:Prothrombin
Type:Protein
Mol. Mass.:70029.57
Organism:Homo sapiens (Human)
Description:P00734
Residue:622
BDBM252980
NameBDBM252980
Synonyms:US9469608, 7-1
TypeSmall organic molecule
Emp. Form.C24H26ClN5O2
Mol. Mass.451.949
SMILESNCc1ccc(Cl)cc1CNC(=O)[C@@H]1CCCN1C(=O)c1cc(Cc2ccncc2)c[nH]1