Reaction Details
TargetProthrombin
LigandBDBM252989
Substrate/Competitorn/a
Meas. Tech.In Vitro Assay
pH7.4±n/a
Ki 49±n/a nM
Commentsextracted
Citation Chobanian, HBiftu, TPio, BWu, Z Thrombin inhibitors US Patent US9469608 Publication Date 10/18/2016
 
Prothrombin
Name:Prothrombin
Type:Protein
Mol. Mass.:70029.57
Organism:Homo sapiens (Human)
Description:P00734
Residue:622
BDBM252989
NameBDBM252989
Synonyms:US9469608, 19-4
TypeSmall organic molecule
Emp. Form.C22H25ClN4O3
Mol. Mass.428.912
SMILESNCc1ccc(Cl)cc1CNC(=O)[C@@H]1CCCN1C(=O)C1(O)CCc2ncccc12