Reaction Details
TargetProthrombin
LigandBDBM252991
Substrate/Competitorn/a
Meas. Tech.In Vitro Assay
pH7.4±n/a
Ki 15±n/a nM
Commentsextracted
Citation Chobanian, HBiftu, TPio, BWu, Z Thrombin inhibitors US Patent US9469608 Publication Date 10/18/2016
 
Prothrombin
Name:Prothrombin
Type:Protein
Mol. Mass.:70029.57
Organism:Homo sapiens (Human)
Description:P00734
Residue:622
BDBM252991
NameBDBM252991
Synonyms:US9469608, 21-6
TypeSmall organic molecule
Emp. Form.C22H24ClN3O3
Mol. Mass.413.897
SMILESNCc1ccc(Cl)cc1CNC(=O)[C@@H]1CCCN1C(=O)C1OCc2ccccc12