Reaction Details
TargetProthrombin
LigandBDBM252994
Substrate/Competitorn/a
Meas. Tech.In Vitro Assay
pH7.4±n/a
Ki 1.1±n/a nM
Commentsextracted
Citation Chobanian, HBiftu, TPio, BWu, Z Thrombin inhibitors US Patent US9469608 Publication Date 10/18/2016
 
Prothrombin
Name:Prothrombin
Type:Protein
Mol. Mass.:70029.57
Organism:Homo sapiens (Human)
Description:P00734
Residue:622
BDBM252994
NameBDBM252994
Synonyms:US9469608, 23-4b
TypeSmall organic molecule
Emp. Form.C22H25ClN4O2
Mol. Mass.412.913
SMILESNCc1ccc(Cl)cc1CNC(=O)[C@@H]1CCCN1C(=O)[C@H]1NCc2ccccc12