Reaction Details
TargetProthrombin
LigandBDBM253015
Substrate/Competitorn/a
Meas. Tech.In Vitro Assay
pH7.4±n/a
Ki 526±n/a nM
Commentsextracted
Citation Chobanian, HBiftu, TPio, BWu, Z Thrombin inhibitors US Patent US9469608 Publication Date 10/18/2016
 
Prothrombin
Name:Prothrombin
Type:Protein
Mol. Mass.:70029.57
Organism:Homo sapiens (Human)
Description:P00734
Residue:622
BDBM253015
NameBDBM253015
Synonyms:US9469608, 43
TypeSmall organic molecule
Emp. Form.C19H25ClN4O3
Mol. Mass.392.88
SMILESC[C@]1(CCCN1C(=O)[C@H]1CCC(=O)N1)C(=O)NCc1cc(Cl)ccc1CN