Reaction Details
TargetMu-type opioid receptor
LigandBDBM50090694
Substrate/Competitorn/a
Meas. Tech.Ligand Binding Assay
pH7.4±n/a
Ki 0.08±n/a nM
Commentsextracted
Citation Lewis, JHusbands, S Orvinol and thevinol derivatives useful in the treatment of anxiety or a compulsive disorder US Patent US9480684 Publication Date 11/1/2016
 
Mu-type opioid receptor
Name:Mu-type opioid receptor
Type:G Protein-Coupled Receptor (GPCR)
Mol. Mass.:44503.11
Organism:Rattus norvegicus (rat)
Description:Competition binding assays were carried out using membrane preparations from transfected HN9.10 cells that constitutively expressed the mu opioid receptor.
Residue:398
BDBM50090694
NameBDBM50090694
Synonyms:CHEMBL3581740 US9480684, 22, R = Ph- BU128
TypeSmall organic molecule
Emp. Form.C31H35NO4
Mol. Mass.485.6139
SMILES[H][C@@]12Oc3c4c(C[C@@]5([H])N(CC6CC6)CC[C@@]14[C@]51C[C@](C)([C@H](O)c4ccccc4)[C@]2(OC)C=C1)ccc3O