Reaction Details
TargetKappa-type opioid receptor
LigandBDBM50090755
Substrate/Competitorn/a
Meas. Tech.Ligand Binding Assay
pH7.4±n/a
Ki 0.05±n/a nM
Commentsextracted
Citation Lewis, JHusbands, S Orvinol and thevinol derivatives useful in the treatment of anxiety or a compulsive disorder US Patent US9480684 Publication Date 11/1/2016
 
Kappa-type opioid receptor
Name:Kappa-type opioid receptor
Type:G Protein-Coupled Receptor (GPCR)
Mol. Mass.:42648.76
Organism:Homo sapiens (Human)
Description:P41145
Residue:380
BDBM50090755
NameBDBM50090755
Synonyms:CHEMBL3581743 US9480684, 22, R = 4- FPh- BU10120
TypeSmall organic molecule
Emp. Form.C31H34FNO4
Mol. Mass.503.6044
SMILES[H][C@@]12Oc3c4c(C[C@@]5([H])N(CC6CC6)CC[C@@]14[C@]51C[C@](C)([C@H](O)c4ccc(F)cc4)[C@]2(OC)C=C1)ccc3O