Reaction Details
TargetNociceptin receptor
LigandBDBM50090760
Substrate/Competitorn/a
Meas. Tech.Ligand Binding Assay
pH7.4±n/a
Ki 80±n/a nM
Commentsextracted
Citation Lewis, JHusbands, S Orvinol and thevinol derivatives useful in the treatment of anxiety or a compulsive disorder US Patent US9480684 Publication Date 11/1/2016
 
Nociceptin receptor
Name:Nociceptin receptor
Type:G Protein-Coupled Receptor (GPCR)
Mol. Mass.:40702.87
Organism:Homo sapiens (Human)
Description:P41146
Residue:370
BDBM50090760
NameBDBM50090760
Synonyms:CHEMBL3581750 US9480684, 30, R = Ph- BU10119
TypeSmall organic molecule
Emp. Form.C31H37NO4
Mol. Mass.487.6298
SMILES[H][C@@]12Oc3c4c(C[C@@]5([H])N(CC6CC6)CC[C@@]14[C@@]51CC[C@@]2(OC)[C@](C)(C1)[C@H](O)c1ccccc1)ccc3O