Reaction Details
TargetCyclin-dependent kinase 6/G1/S-specific cyclin-D3
LigandBDBM253928
Substrate/Competitorn/a
Meas. Tech.Caliper Assay
IC50 5.64±n/a nM
Citation Strum, JCBisi, JERoberts, PJTavares, FX Transient protection of normal cells during chemotherapy US Patent US9464092 Publication Date 10/11/2016
 
Cyclin-dependent kinase 6/G1/S-specific cyclin-D3
Name:Cyclin-dependent kinase 6/G1/S-specific cyclin-D3
Type:Protein
Mol. Mass.:n/a
Description:n/a
Components:This complex has 2 components.
Component 1
Name:Cyclin-dependent kinase 6
Synonyms:CDK6 CDKN6 Cyclin-dependent kinase 6 (CDK 6) | Serine/threonine-protein kinase PLSTIRE
Type:Enzyme Subunit
Mol. Mass.:36937.42
Organism:Homo sapiens (Human)
Description:Q00534
Residue:326
Component 2
Name:G1/S-specific cyclin-D3
Synonyms:CCND3 | CCND3_HUMAN
Type:Enzyme
Mol. Mass.:32521.90
Organism:Homo sapiens (Human)
Description:P30281
Residue:292
BDBM253928
NameBDBM253928
Synonyms:US10189849, Compound 27 US9464092, T US9957276, Compound 27
TypeSmall organic molecule
Emp. Form.C24H30N8O
Mol. Mass.446.548
SMILESCN1CCN(CC1)c1ccc(Nc2ncc3cc4C(=O)NCC5(CCCCC5)n4c3n2)nc1