Reaction Details
TargetCytochrome P450 2C9
LigandBDBM253987
Substrate/Competitorn/a
Meas. Tech.Inhibition Assays
IC50 900±n/a nM
Citation Reiser, U 6-alkynyl-pyridine derivatives US Patent US9481673 Publication Date 11/1/2016
 
Cytochrome P450 2C9
Name:Cytochrome P450 2C9
Type:Enzyme
Mol. Mass.:55636.33
Organism:Homo sapiens (Human)
Description:P11712
Residue:490
BDBM253987
NameBDBM253987
Synonyms:US9481673, 81
TypeSmall organic molecule
Emp. Form.C34H29N7O2
Mol. Mass.567.6398
SMILESCNC(C)C(=O)Nc1ccc(-c2c(nc3cc(C)ccn23)-c2ccncc2)c(n1)C#Cc1ccc2n(C)c(=O)ccc2c1