Reaction Details
TargetBaculoviral IAP repeat-containing protein 2 [256-363]
LigandBDBM254003
Substrate/Competitorn/a
Meas. Tech.Binding Assays (DELFIA)
Temperature298.15±n/a K
IC50 1±n/a nM
Commentsextracted
Citation Reiser, U 6-alkynyl-pyridine derivatives US Patent US9481673 Publication Date 11/1/2016
 
Baculoviral IAP repeat-containing protein 2 [256-363]
Name:Baculoviral IAP repeat-containing protein 2 [256-363]
Type:Enzyme
Mol. Mass.:12600.71
Organism:Homo sapiens (Human)
Description:Human cIAP BIR3 domain (256-363 aa)
Residue:108
BDBM254003
NameBDBM254003
Synonyms:US9481673, (S)-13
TypeSmall organic molecule
Emp. Form.C35H31N7O3
Mol. Mass.597.6657
SMILESCN[C@@H](C)C(=O)Nc1ccc(-c2c(nc3cc(C)ccn23)-c2ccnc(OC)c2)c(n1)C#Cc1ccc2n(C)c(=O)ccc2c1