Reaction Details
TargetApoptosis regulator Bcl-2/Glutathione S-transferase P
LigandBDBM185594
Substrate/Competitorn/a
Meas. Tech.Time Resolved-Fluorescence Resonance Energy Transfer (TR-FRET) Assay
Temperature298.15±n/a K
Ki 51.702±n/a nM
Commentsextracted
Citation Kunzer, ARElmore, SWSullivan, GM Apoptosis-inducing agent for the treatment of cancer and immune and autoimmune diseases US Patent US9493431 Publication Date 11/15/2016
 
Apoptosis regulator Bcl-2/Glutathione S-transferase P
Name:Apoptosis regulator Bcl-2/Glutathione S-transferase P
Synonyms:GST-Bcl-2 Protein
Type:Protein
Mol. Mass.:n/a
Description:n/a
Components:This complex has 2 components.
Component 1
Name:Apoptosis regulator Bcl-2
Type:Homodimer or heterodimer
Mol. Mass.:26269.11
Organism:Homo sapiens (Human)
Description:P10415
Residue:239
Component 2
Name:Glutathione S-transferase P
Synonyms:FAEES3 GST3 GSTP1-1 Glutathione S-transferase Glutathione S-transferase P Glutathione transferase (GST)
Type:Enzyme
Mol. Mass.:23353.53
Organism:Homo sapiens (Human)
Description:P09211
Residue:210
BDBM185594
NameBDBM185594
Synonyms:US9156856, 3 | US9493431, 3
TypeSmall organic molecule
Emp. Form.C42H46N6O5S3
Mol. Mass.811.047
SMILES[#6]-[#7](-[#6])-[#6]-[#6]-[#6@H](-[#6]-[#16]-c1ccccc1)-[#7]-c1sc(cc1-[#7+](-[#8-])=O)S(=O)(=O)[#7]-[#6](=O)-c1ccc(cc1)-[#7]-1-[#6]-[#6]-[#7](-[#6]\[#6]=[#6](\c2ccccc2)-c2ccccc2)-[#6]-[#6]-1