Reaction Details
TargetTyrosine-protein kinase JAK1
LigandBDBM255022
Substrate/Competitorn/a
Meas. Tech.Enzyme Assay
IC50 3.4±n/a nM
Citation Takahashi, KWatanabe, THayashi, KKurihara, KNakamura, TYamamoto, ANishimura, TKamiyama, THidaka, Y Tricyclic pyrrolopyridine compound, and JAK inhibitor US Patent US9475813 Publication Date 10/25/2016
 
Tyrosine-protein kinase JAK1
Name:Tyrosine-protein kinase JAK1
Type:Protein
Mol. Mass.:133293.73
Organism:Homo sapiens (Human)
Description:P23458
Residue:1154
BDBM255022
NameBDBM255022
Synonyms:US9475813, 27
TypeSmall organic molecule
Emp. Form.C22H27F3N6O
Mol. Mass.448.4846
SMILESFC(F)(F)CNC[C@H]1CC[C@@H](CC1)N1CN(CCCC#N)C(=O)c2cnc3[nH]ccc3c12